{"text_format":"3","workbook":"xlsx","n_sheets":5,"sheets":["全部（按机构岗位排名）","面试人员名单","Sheet1","副本","Sheet2"],"not_rendered":{"external_links":1,"defined_names":4},"read":"whole","date_system":"1900"}

{"sheet":"全部（按机构岗位排名）","index":0,"n_rows":586,"n_cols":17,"rows_kept":586,"hidden":true}
["姓名","性别","证件号码","准考证号","最高学历\n学校","最高学历\n此阶段的专业","最高学历\n此阶段的学历","机构","职位编号","岗位类别","报考岗位","座位号","行测","专业能力","总分","签到情况","备注"]
["金斌","女","210105199005154920","04011120902","中国社会科学院研究生院","公共管理","硕士研究生","家粮食和物资储备局科学研究院","04011",{"$f":"VLOOKUP(I2,[1]公开招聘工作人员岗位信息!$H$4:$I$50,2,FALSE)","v":"管理"},"科研管理处管理岗",2,63,79.75,null,"是","性别身份证不符（系统里面填写错误）"]
["盛天琪","女","110111199403241628","04011120901","庆熙大学","工商管理","硕士研究生","家粮食和物资储备局科学研究院","04011",{"$f":"VLOOKUP(I3,[1]公开招聘工作人员岗位信息!$H$4:$I$50,2,FALSE)","v":"管理"},"科研管理处管理岗",1,0,0,null,"否","缺考"]
["闫雨晴","女","342224199507171347","04011120903","首都经济贸易大学","行政管理","硕士研究生","家粮食和物资储备局科学研究院","04011",{"$f":"VLOOKUP(I4,[1]公开招聘工作人员岗位信息!$H$4:$I$50,2,FALSE)","v":"管理"},"科研管理处管理岗",3,0,0,null,"否","缺考"]
["范子超","男","110223199210153534","04021070401","中国哦农业机械化科学研究院","农产品加工及贮藏工程","硕士研究生","家粮食和物资储备局科学研究院","04021",{"$f":"VLOOKUP(I5,[1]公开招聘工作人员岗位信息!$H$4:$I$50,2,FALSE)","v":"专业技术"},"《粮油食品科技》编辑部专业技术岗",1,0,0,null,"否","缺考"]
["宋戈","女","412724199501080343","04021070402","北京科技大学","生物技术","硕士研究生","家粮食和物资储备局科学研究院","04021",{"$f":"VLOOKUP(I6,[1]公开招聘工作人员岗位信息!$H$4:$I$50,2,FALSE)","v":"专业技术"},"《粮油食品科技》编辑部专业技术岗",2,0,0,null,"否","缺考"]
["左聪聪","女","370902199502110020","04021070403","中国农业大学","食品科学与工程","硕士研究生","家粮食和物资储备局科学研究院","04021",{"$f":"VLOOKUP(I7,[1]公开招聘工作人员岗位信息!$H$4:$I$50,2,FALSE)","v":"专业技术"},"《粮油食品科技》编辑部专业技术岗",3,0,0,null,"否","缺考"]
["王亚然","女","131023199207231443","04031010113","中国矿业大学(北京)","安全工程","硕士研究生","家粮食和物资储备局科学研究院","04031",{"$f":"VLOOKUP(I8,[1]公开招聘工作人员岗位信息!$H$4:$I$50,2,FALSE)","v":"专业技术"},"粮食储运研究所专业技术岗（1）",13,54,71,null,"是"]
["崔鹏程","男","410881199304010814","04031010111","中国矿业大学(北京)","安全工程","硕士研究生","家粮食和物资储备局科学研究院","04031",{"$f":"VLOOKUP(I9,[1]公开招聘工作人员岗位信息!$H$4:$I$50,2,FALSE)","v":"专业技术"},"粮食储运研究所专业技术岗（1）",11,54,69,null,"是"]
["梁倩倩","女","370783199310080565","04031010106","北京交通大学","安全工程","硕士研究生","家粮食和物资储备局科学研究院","04031",{"$f":"VLOOKUP(I10,[1]公开招聘工作人员岗位信息!$H$4:$I$50,2,FALSE)","v":"专业技术"},"粮食储运研究所专业技术岗（1）",6,53,69,null,"是"]
["姜圩","男","140423199210220414","04031010104","中国地质大学(北京)","安全工程","硕士研究生","家粮食和物资储备局科学研究院","04031",{"$f":"VLOOKUP(I11,[1]公开招聘工作人员岗位信息!$H$4:$I$50,2,FALSE)","v":"专业技术"},"粮食储运研究所专业技术岗（1）",4,58,64.5,null,"是"]
["李亚男","女","13072819940821004X","04031010121","首都经济贸易大学","安全工程","硕士研究生","家粮食和物资储备局科学研究院","04031",{"$f":"VLOOKUP(I12,[1]公开招聘工作人员岗位信息!$H$4:$I$50,2,FALSE)","v":"专业技术"},"粮食储运研究所专业技术岗（1）",21,56,65,null,"是","未带学生证"]
["张翰林","男","340823199206060410","04031010118","中国石油大学(北京)","安全工程","硕士研究生","家粮食和物资储备局科学研究院","04031",{"$f":"VLOOKUP(I13,[1]公开招聘工作人员岗位信息!$H$4:$I$50,2,FALSE)","v":"专业技术"},"粮食储运研究所专业技术岗（1）",18,49,67.5,null,"是"]
["田苑","女","36232919920709482X","04031010123","首都经济贸易大学","安全科学与工程","硕士研究生","家粮食和物资储备局科学研究院","04031",{"$f":"VLOOKUP(I14,[1]公开招聘工作人员岗位信息!$H$4:$I$50,2,FALSE)","v":"专业技术"},"粮食储运研究所专业技术岗（1）",23,50,60.5,null,"是"]
["王博雅","女","142402199309080028","04031010115","中国地质大学(北京)","安全工程","硕士研究生","家粮食和物资储备局科学研究院","04031",{"$f":"VLOOKUP(I15,[1]公开招聘工作人员岗位信息!$H$4:$I$50,2,FALSE)","v":"专业技术"},"粮食储运研究所专业技术岗（1）",15,55,57,null,"是"]
["申杰升","男","142625199403031252","04031010122","中国矿业大学(北京)","安全工程","硕士研究生","家粮食和物资储备局科学研究院","04031",{"$f":"VLOOKUP(I16,[1]公开招聘工作人员岗位信息!$H$4:$I$50,2,FALSE)","v":"专业技术"},"粮食储运研究所专业技术岗（1）",22,52,58,null,"是"]
["孙冉","男","130828199302010838","04031010114","北京科技大学","安全工程","硕士研究生","家粮食和物资储备局科学研究院","04031",{"$f":"VLOOKUP(I17,[1]公开招聘工作人员岗位信息!$H$4:$I$50,2,FALSE)","v":"专业技术"},"粮食储运研究所专业技术岗（1）",14,54,55.5,null,"是"]
["井淼","男","22010619930104023X","04031010119","中国地质大学(北京)","安全工程","硕士研究生","家粮食和物资储备局科学研究院","04031",{"$f":"VLOOKUP(I18,[1]公开招聘工作人员岗位信息!$H$4:$I$50,2,FALSE)","v":"专业技术"},"粮食储运研究所专业技术岗（1）",19,45,59,null,"是"]
["曹梦凡","女","130622199209226627","04031010107","首都经济贸易大学","安全工程","硕士研究生","家粮食和物资储备局科学研究院","04031",{"$f":"VLOOKUP(I19,[1]公开招聘工作人员岗位信息!$H$4:$I$50,2,FALSE)","v":"专业技术"},"粮食储运研究所专业技术岗（1）",7,55,52,null,"是"]
["张继友","男","130123199302226911","04031010103","中国矿业大学(北京)","安全工程","硕士研究生","家粮食和物资储备局科学研究院","04031",{"$f":"VLOOKUP(I20,[1]公开招聘工作人员岗位信息!$H$4:$I$50,2,FALSE)","v":"专业技术"},"粮食储运研究所专业技术岗（1）",3,66,45,null,"是"]
{"$rows_left_out":567}
{"sheet":"面试人员名单","index":1,"n_rows":12,"n_cols":4,"rows_kept":12,"merged":[[0,0,0,3],[2,1,11,1]]}
["国家粮食和物资储备局科学研究院                                                                                                        粮油加工研究所面试人员名单"]
["序号","岗位","姓名","备注"]
[1,"司机兼行政助理","韩世杰"]
[2,null,"刘尊"]
[3,null,"赵康一"]
[4,null,"胡俊洋"]
[5,null,"魏昭"]
[6,null,"靳浩东"]
[7,null,"张志星"]
[8,null,"王琦"]
[9,null,"冀恒翔"]
[10,null,"韩鹏宇"]

{"sheet":"Sheet1","index":2,"n_rows":0,"n_cols":0,"rows_kept":0}

{"sheet":"副本","index":3,"n_rows":525,"n_cols":38,"rows_kept":525,"hidden":true}
["考场号","职位编号","简历编号","教室号","姓名","性别","出生日期","证件号码","证件号码","民族","婚姻状况","政治面貌","最高教育背景学历","最高教育背景学校","最高学历毕业时间","当前户籍所在地","当前户籍类型","生源地","家庭住址","目前所在城市","手机号","电子邮件","其他联系方式","其他联系方式","最高学历-开始日期","最高学历-结束日期","最高学历-学校","最高学历-此阶段的专业","最高学历-此阶段的专业","最高学历-此阶段的学历","最高学历-此阶段的学位","最高学历-班级排名","编号","应聘职位","所属机构","消息状态","准考证号","座位号"]
["第一考场","04031",100029,205,"杜洋","男","1995-06-11","身份证","130828199506116116","蒙古族","未婚","共青团员","硕士研究生","首都经济贸易大学","2019-07-01","丰台区","学校集体户","围场满族蒙古族自治县","河北省承德市围场县山湾子乡杨树沟村12组","丰台区","13501031772","13501031772@163.com","家庭电话","13501031772","2017-09-01","2019-07-01","首都经济贸易大学","安全科学与工程类","安全工程","硕士研究生","硕士","前 10%","100029","专业技术岗（1）","国家粮食和物资储备局  国家粮食和物资储备局科学研究院  粮食储运研究所","已确认","04031010101",1]
["第一考场","04031",100039,205,"王旭昭","男","1992-09-15","身份证","130132199209150031","汉族","未婚","中共党员","硕士研究生","北京交通大学","2019-06-30","元氏县","居民户","元氏县","河北省石家庄市元氏县","海淀区","15810238981","294425890@qq.com","","","2016-09-01","2019-06-30","北京交通大学","安全科学与工程类","安全工程","硕士研究生","硕士","前 10%","100039","专业技术岗（1）","国家粮食和物资储备局  国家粮食和物资储备局科学研究院  粮食储运研究所","已确认","04031010102",2]
["第一考场","04031",100167,205,"张继友","男","1993-02-22","身份证","130123199302226911","汉族","未婚","中共党员","硕士研究生","中国矿业大学(北京)","2019-06-30","裕华区","居民户","裕华区","河北省石家庄市裕华区祁连街","海淀区","18801299971","yolozhang@hotmail.com","","","2016-09-08","2019-06-30","中国矿业大学(北京)","安全科学与工程类","安全工程","硕士研究生","硕士","前 20%","100167","专业技术岗（1）","国家粮食和物资储备局  国家粮食和物资储备局科学研究院  粮食储运研究所","已确认","04031010103",3]
["第一考场","04031",100175,205,"姜圩","男","1992-10-22","身份证","140423199210220414","汉族","未婚","中共党员","硕士研究生","中国地质大学(北京)","2019-06-06","海淀区","学校集体户","屯留县","山西省长治市常村煤矿家属区","海淀区","18811799808","1317805611@qq.com","","","2016-09-01","2019-06-09","中国地质大学(北京)","安全科学与工程类","安全工程","硕士研究生","硕士","前 30%","100175","专业技术岗（1）","国家粮食和物资储备局  国家粮食和物资储备局科学研究院  粮食储运研究所","已确认","04031010104",4]
["第一考场","04031",100176,205,"孙浩","男","1992-08-19","身份证","140429199208190410","汉族","未婚","共青团员","硕士研究生","天津理工大学","2019-03-31","武乡县","居民户","武乡县","山西省长治市武乡县洪水镇白和村","西青区","15822738892","823576942@qq.com","","","2016-09-01","2019-04-05","天津理工大学","安全科学与工程类","安全工程","硕士研究生","硕士","前 10%","100176","专业技术岗（1）","国家粮食和物资储备局  国家粮食和物资储备局科学研究院  粮食储运研究所","已确认","04031010105",5]
["第一考场","04031",100227,205,"梁倩倩","女","1993-10-08","身份证","370783199310080565","汉族","未婚","中共党员","硕士研究生","北京交通大学","2019-07-01","寿光市","居民户","寿光市","山东省寿光市文家街道赵家村188号","海淀区","17801185182","16120953@bjtu.edu.cn","","","2016-09-01","2019-07-01","北京交通大学","安全科学与工程类","安全工程","硕士研究生","硕士","前 5%","100227","专业技术岗（1）","国家粮食和物资储备局  国家粮食和物资储备局科学研究院  粮食储运研究所","已确认","04031010106",6]
["第一考场","04031",100310,205,"曹梦凡","女","1992-09-22","身份证","130622199209226627","汉族","未婚","中共党员","硕士研究生","首都经济贸易大学","2019-06-30","清苑区","居民户","清苑区","河北省保定市清苑区","丰台区","13120189066","2373518391@qq.com","","","2016-09-08","2019-06-30","首都经济贸易大学","安全科学与工程类","安全工程","硕士研究生","硕士","前 20%","100310","专业技术岗（1）","国家粮食和物资储备局  国家粮食和物资储备局科学研究院  粮食储运研究所","已确认","04031010107",7]
["第一考场","04031",100357,205,"王嗣鑫","男","1992-08-31","身份证","370911199208316833","汉族","未婚","中共党员","硕士研究生","中国矿业大学(北京)","2019-06-30","岱岳区","居民户","岱岳区","山东省泰安市岱岳区天平街道周家庄村","海淀区","15810836121","wsx1614@buaa.edu.cn","","","2016-09-01","2019-06-30","中国矿业大学(北京)","安全科学与工程类","安全工程","硕士研究生","硕士","前 10%","100357","专业技术岗（1）","国家粮食和物资储备局  国家粮食和物资储备局科学研究院  粮食储运研究所","已确认","04031010108",8]
["第一考场","04031",100359,205,"陈婷","女","1992-10-02","身份证","411481199210023920","汉族","未婚","中共党员","硕士研究生","天津理工大学","2019-03-31","永城市","居民户","永城市","河南省永城市","西青区","18322693380","1464372295@qq.com","其他","15393702872","2016-08-01","2019-03-31","天津理工大学","安全科学与工程类","安全工程","硕士研究生","硕士","前 10%","100359","专业技术岗（1）","国家粮食和物资储备局  国家粮食和物资储备局科学研究院  粮食储运研究所","已确认","04031010109",9]
["第一考场","04031",100458,205,"周航","男","1993-05-28","身份证","370883199305280015","汉族","未婚","共青团员","硕士研究生","中国石油大学(华东)","2019-06-30","邹城市","居民户","邹城市","山东省邹城市太平西路2129号","黄岛区","15763949510","hankchou_upc@163.com","","","2016-09-01","2019-06-30","中国石油大学(华东)","安全科学与工程类","安全工程","硕士研究生","硕士","前 20%","100458","专业技术岗（1）","国家粮食和物资储备局  国家粮食和物资储备局科学研究院  粮食储运研究所","已确认","04031010110",10]
["第一考场","04031",100978,205,"崔鹏程","男","1993-04-01","身份证","410881199304010814","汉族","未婚","中共党员","硕士研究生","中国矿业大学(北京)","2019-06-30","济源","居民户","济源","河南省济源市轵城镇交兑新村一队","海淀区","18811776127","18811776127@163.com","","","2016-09-01","2019-06-30","中国矿业大学(北京)","安全科学与工程类","安全工程","硕士研究生","硕士","前 5%","100978","专业技术岗（1）","国家粮食和物资储备局  国家粮食和物资储备局科学研究院  粮食储运研究所","已确认","04031010111",11]
["第一考场","04031",101054,205,"张军","男","1993-09-13","身份证","152728199309132133","汉族","未婚","共青团员","硕士研究生","中国矿业大学(北京)","2019-06-25","伊金霍洛旗","居民户","伊金霍洛旗","内蒙古鄂尔多斯市伊金霍洛旗文明小区","海淀区","18811738533","cumtbzj@126.com","其他","18211140248","2016-09-01","2019-06-20","中国矿业大学(北京)","安全科学与工程类","安全工程","硕士研究生","硕士","前 5%","101054","专业技术岗（1）","国家粮食和物资储备局  国家粮食和物资储备局科学研究院  粮食储运研究所","已确认","04031010112",12]
["第一考场","04031",101060,205,"王亚然","女","1992-07-23","身份证","131023199207231443","汉族","未婚","中共党员","硕士研究生","中国矿业大学(北京)","2019-07-01","永清县","居民户","永清县","河北省廊坊市永清县里澜城镇王场村","海淀区","13146865211","wyr_cumtb@163.com","","","2016-09-08","2019-07-01","中国矿业大学(北京)","安全科学与工程类","安全工程","硕士研究生","硕士","前 20%","101060","专业技术岗（1）","国家粮食和物资储备局  国家粮食和物资储备局科学研究院  粮食储运研究所","已确认","04031010113",13]
["第一考场","04031",101114,205,"孙冉","男","1993-02-01","身份证","130828199302010838","满族","未婚","中共党员","硕士研究生","北京科技大学","2019-01-15","围场满族蒙古族自治县","居民户","围场满族蒙古族自治县","河北省承德市围场县腰站镇","海淀区","18801259023","sunran112699@163.com","","","2016-09-06","2019-01-15","北京科技大学","安全科学与工程类","安全工程","硕士研究生","硕士","前 5%","101114","专业技术岗（1）","国家粮食和物资储备局  国家粮食和物资储备局科学研究院  粮食储运研究所","已确认","04031010114",14]
["第一考场","04031",101223,205,"王博雅","女","1993-09-08","身份证","142402199309080028","汉族","未婚","中共党员","硕士研究生","中国地质大学(北京)","2019-07-01","海淀区","学校集体户","介休市","山西省介休市宋古小区","海淀区","15810079096","535118224@qq.com","家庭电话","13834081185","2016-09-01","2019-07-01","中国地质大学(北京)","安全科学与工程类","安全工程","硕士研究生","硕士","前 20%","101223","专业技术岗（1）","国家粮食和物资储备局  国家粮食和物资储备局科学研究院  粮食储运研究所","已确认","04031010115",15]
["第一考场","04031",101271,205,"吴京昌","男","1994-01-13","身份证","370683199401134519","汉族","未婚","中共党员","硕士研究生","北京理工大学","2019-06-30","莱州市","居民户","莱州市","山东省莱州市文峰路街道万家村","海淀区","18810990235","m18810990235@163.com","","","2016-09-01","2019-06-30","北京理工大学","安全科学与工程类","安全工程","硕士研究生","硕士","前 20%","101271","专业技术岗（1）","国家粮食和物资储备局  国家粮食和物资储备局科学研究院  粮食储运研究所","已确认","04031010116",16]
["第一考场","04031",101296,205,"翟存利","女","1992-11-13","身份证","130428199211133726","汉族","未婚","中共党员","硕士研究生","中国矿业大学(北京)","2019-07-01","肥乡区","居民户","邯山区","河北省邯郸市肥乡区","海淀区","18800171500","zhaicunli@126.com","","","2016-09-01","2019-07-01","中国矿业大学(北京)","安全科学与工程类","安全工程","硕士研究生","硕士","前 5%","101296","专业技术岗（1）","国家粮食和物资储备局  国家粮食和物资储备局科学研究院  粮食储运研究所","已确认","04031010117",17]
["第一考场","04031",101348,205,"张翰林","男","1992-06-06","身份证","340823199206060410","汉族","未婚","中共党员","硕士研究生","中国石油大学(北京)","2019-07-01","枞阳县","居民户","枞阳县","安徽省铜陵市枞阳县官埠桥镇官山村沙埂组20号","昌平区","18811633589","zhl18811633589@163.com","","","2016-09-01","2019-07-01","中国石油大学(北京)","安全科学与工程类","安全工程","硕士研究生","硕士","其它","101348","专业技术岗（1）","国家粮食和物资储备局  国家粮食和物资储备局科学研究院  粮食储运研究所","已确认","04031010118",18]
["第一考场","04031",101416,205,"井淼","男","1993-01-04","身份证","22010619930104023X","汉族","未婚","中共党员","硕士研究生","中国地质大学(北京)","2019-07-01","绿园区","学校集体户","绿园区","吉林省","海淀区","13321127011","13321127011@163.com","家庭电话","13341403695","2016-09-12","2019-06-24","中国地质大学(北京)","安全科学与工程类","安全工程","硕士研究生","硕士","前 30%","101416","专业技术岗（1）","国家粮食和物资储备局  国家粮食和物资储备局科学研究院  粮食储运研究所","已确认","04031010119",19]
{"$rows_left_out":506}
{"sheet":"Sheet2","index":4,"n_rows":26,"n_cols":38,"rows_kept":26,"hidden":true}
["考场号","教室号","简历编号","姓名","性别","出生日期","证件号码","证件号码","民族","婚姻状况","政治面貌","最高教育背景学历","最高教育背景学校","最高学历毕业时间","当前户籍所在地","当前户籍类型","生源地","家庭住址","目前所在城市","手机号","电子邮件","其他联系方式","其他联系方式","最高学历-开始日期","最高学历-结束日期","最高学历-学校","最高学历-此阶段的专业","最高学历-此阶段的专业","最高学历-此阶段的学历","最高学历-此阶段的学位","最高学历-班级排名","编号","应聘职位","职位编号","所属机构","消息状态","准考证号","座位号"]
["第二考场",209,100880,"孔宪敏","女","1984-03-07","身份证","371203198403073724","汉族","未婚","群众","博士研究生","北京工业大学","2019-07-01","朝阳区","学校集体户","钢城区","山东省济南市钢城区北赵园","朝阳区","15101151536","965204298@qq.com","","","2015-09-01","2019-07-01","北京工业大学","生物医学工程类","生物医学工程","博士研究生","博士（后）","前 5%","100880","专业技术岗（1）","04051","国家粮食和物资储备局  国家粮食和物资储备局科学研究院  粮食品质营养研究所","已确认","04051020201",1]
["第二考场",209,101053,"庞建","男","1990-05-01","身份证","210624199005013016","汉族","已婚","中共党员","博士研究生","内蒙古工业大学","2019-12-08","宽甸满族自治县","居民户","宽甸满族自治县","辽宁省丹东市宽甸满族自治县古楼子乡古楼子村","即墨市","15764716659","291204097@qq.com","","","2006-09-01","2019-12-01","内蒙古工业大学","生物工程类","生物工程","博士研究生","博士（后）","其它","101053","专业技术岗（1）","04051","国家粮食和物资储备局  国家粮食和物资储备局科学研究院  粮食品质营养研究所","已确认","04051020202",2]
["第二考场",209,102284,"李磊","男","1987-01-10","身份证","371321198701108516","汉族","已婚","中共党员","其他:博士后","北京大学","2019-07-20","海淀区","工作单位集体户","沂南县","东城区磁器口站西花市大街8号新景家园11号楼","海淀区","17801009201","lilei@bjmu.edu.cn","","","2017-07-03","2019-07-12","北京大学","生物学","微生物学","博士研究生","博士（后）","前 5%","102284","专业技术岗（1）","04051","国家粮食和物资储备局  国家粮食和物资储备局科学研究院  粮食品质营养研究所","已确认","04051020203",3]
["第二考场",209,100037,"施晶晶","男","1990-06-17","身份证","320882199006172211","汉族","未婚","共青团员","博士研究生","北京化工大学","2019-07-01","淮安区","其他:农业户口","淮安区","江苏省淮安市淮安区溪河镇","朝阳区","13371732026","shijingjingbuct@163.com","","","2016-09-01","2019-09-01","北京化工大学","化学类","化学","博士研究生","博士（后）","前 10%","100037","专业技术岗（3）","04053","国家粮食和物资储备局  国家粮食和物资储备局科学研究院  粮食品质营养研究所","已确认","04051030204",4]
["第二考场",209,100103,"裴晓静","女","1989-02-04","身份证","371325198902044024","汉族","已婚","中共党员","博士研究生","北京大学","2019-07-01","费县","学校集体户","费县","北京市海淀区颐和园路5号北京大学","海淀区","18911189951","pxj0187@pku.edu.cn","其他","18910559588","2017-09-01","2019-07-01","北京大学","化学类","分析化学","博士研究生","博士（后）","前 5%","100103","专业技术岗（3）","04053","国家粮食和物资储备局  国家粮食和物资储备局科学研究院  粮食品质营养研究所","已确认","04051030205",5]
["第二考场",209,100125,"谢昌健","男","1990-06-05","身份证","342522199006053610","汉族","未婚","群众","博士研究生","中国科学院大学","2019-07-01","海淀区","学校集体户","郎溪县","安徽省宣城市郎溪县飞里镇","石景山区","13051565075","xiecj@ihep.ac.cn","","","2016-09-01","2019-07-01","中国科学院大学","化学类","无机化学","博士研究生","博士（后）","前 5%","100125","专业技术岗（3）","04053","国家粮食和物资储备局  国家粮食和物资储备局科学研究院  粮食品质营养研究所","已确认","04051030206",6]
["第二考场",209,100648,"周烨","女","1990-07-20","身份证","220204199007202122","汉族","未婚","中共党员","博士研究生","国内院校-辽宁省-其他辽宁院校:中国科学院大连化学物理研究所","2019-07-01","沙河口区","学校集体户","沙河口区","辽宁省大连市沙河口区中山路457号大连化物所研究生教育大厦B座","沙河口区","18604328720","zhouye@dicp.ac.cn","","","2013-09-01","2019-06-30","国内院校-辽宁省-其他辽宁院校:中国科学院大连化学物理研究所","化学类","分析化学","博士研究生","博士（后）","前 10%","100648","专业技术岗（3）","04053","国家粮食和物资储备局  国家粮食和物资储备局科学研究院  粮食品质营养研究所","已确认","04051030207",7]
["第二考场",209,100959,"王晋芳","女","1989-07-09","身份证","140511198907094425","汉族","已婚","中共党员","博士研究生","中国人民大学","2019-06-10","海淀区","学校集体户","泽州县","北京市房山区长阳镇长龙苑小区","海淀区","18813006658","jinfang_wang@ruc.edu.cn","","","2014-09-01","2019-06-01","中国人民大学","化学类","化学","博士研究生","博士（后）","前 5%","100959","专业技术岗（3）","04053","国家粮食和物资储备局  国家粮食和物资储备局科学研究院  粮食品质营养研究所","已确认","04051030208",8]
["第二考场",209,101596,"赵欣欣","女","1988-08-02","身份证","410222198808025086","汉族","已婚","中共党员","博士研究生","河南农业大学","2019-06-20","通许县","居民户","通许县","北京市大兴区黄村新城北区金星西路与兴泰路交叉口首邑溪谷小区","中原区","13213060982","zhaoxinxin1988@163.com","","","2014-09-01","2019-06-20","河南农业大学","食品科学与工程类","农产品加工及贮藏工程","博士研究生","博士（后）","前 10%","101596","专业技术岗（3）","04053","国家粮食和物资储备局  国家粮食和物资储备局科学研究院  粮食品质营养研究所","已确认","04051030209",9]
["第二考场",209,101719,"张晓锐","女","1990-07-03","身份证","130721199007030529","汉族","未婚","中共党员","博士研究生","中国科学院大学","2019-06-30","桥东区","居民户","桥东区","河北省张家口市桥东区大仓盖镇大仓盖村大寨路东3排3号","海淀区","13691334173","zhxrui0703@163.com","家庭电话","1980123427","2016-09-01","2019-07-15","中国科学院大学","化学类","化学","博士研究生","博士（后）","前 10%","101719","专业技术岗（3）","04053","国家粮食和物资储备局  国家粮食和物资储备局科学研究院  粮食品质营养研究所","已确认","04051030210",10]
["第二考场",209,100489,"尹鹏","男","1994-10-18","身份证","140603199410184353","汉族","未婚","中共党员","硕士研究生","北京化工大学","2019-07-01","平鲁区","居民户","平鲁区","山西朔州","朝阳区","17801197735","17801197735@163.com","","","2016-09-01","2019-07-01","北京化工大学","轻工类","发酵工程","硕士研究生","硕士","前 20%","100489","专业技术岗（2）","04062","国家粮食和物资储备局  国家粮食和物资储备局科学研究院  粮油加工研究所","已确认","04062040211",11]
["第二考场",209,100565,"孙思佳","女","1994-01-10","身份证","410203199401102049","汉族","未婚","中共党员","硕士研究生","国内院校-北京-其他北京院校:中国食品发酵工业研究院","2019-04-06","朝阳区","学校集体户","顺河回族区","河南省开封市顺河回族区东苑小区二期13号楼四单元","朝阳区","18618103324","heavenssj@163.com","其他","13521598728","2016-09-01","2019-04-08","国内院校-北京-其他北京院校:中国食品发酵工业研究院","轻工类","发酵工程","硕士研究生","硕士","前 5%","100565","专业技术岗（2）","04062","国家粮食和物资储备局  国家粮食和物资储备局科学研究院  粮油加工研究所","已确认","04062040212",12]
["第二考场",209,100674,"张波","女","1992-10-10","身份证","130627199210101647","汉族","未婚","中共党员","硕士研究生","河北农业大学","2019-06-30","唐县","居民户","唐县","河北省保定市唐县","莲池区","15832235631","15832235631@163.com","","","2016-09-06","2019-06-30","河北农业大学","其他:发酵工程","其他:发酵工程","硕士研究生","硕士","前 5%","100674","专业技术岗（2）","04062","国家粮食和物资储备局  国家粮食和物资储备局科学研究院  粮油加工研究所","已确认","04062040213",13]
["第二考场",209,100724,"王一丹","女","1992-09-14","身份证","130527199209141224","汉族","未婚","共青团员","硕士研究生","南京农业大学","2019-06-30","南和县","居民户","玄武区","河北省邢台市南和县","南和县","15261865181","15261865181@163.com","家庭电话","13784940913","2016-09-04","2019-06-30","南京农业大学","轻工类","发酵工程","硕士研究生","硕士","前 30%","100724","专业技术岗（2）","04062","国家粮食和物资储备局  国家粮食和物资储备局科学研究院  粮油加工研究所","已确认","04062040214",14]
["第二考场",209,101443,"王晨慧","女","1995-05-26","身份证","130730199505263444","汉族","未婚","中共党员","硕士研究生","国内院校-北京-其他北京院校:中国食品发酵工业研究院","2019-04-15","朝阳区","学校集体户","怀来县","北京市朝阳区酒仙桥中路24号院6号楼","朝阳区","17310485813","120564741@qq.com","其他","17310485813","2016-09-01","2019-04-15","国内院校-其他学校:中国食品发酵工业研究院","其他:发酵工程","其他:发酵工程","硕士研究生","硕士","前 5%","101443","专业技术岗（2）","04062","国家粮食和物资储备局  国家粮食和物资储备局科学研究院  粮油加工研究所","已确认","04062040215",15]
["第二考场",209,100610,"魏杰","男","1992-04-11","身份证","410526199204118210","汉族","未婚","共青团员","硕士研究生","中国农业科学院研究生院","2019-06-20","滑县","居民户","滑县","河南省滑县焦虎乡","海淀区","17801116708","weijiejawin@163.com","","","2016-08-30","2019-06-20","中国农业科学院研究生院","动物生产类","动物营养与饲料科学","硕士研究生","硕士","前 5%","100610","专业技术岗（4）","04064","国家粮食和物资储备局  国家粮食和物资储备局科学研究院  粮油加工研究所","已确认","04064050216",16]
["第二考场",209,100782,"李岩","女","1992-02-19","身份证","22240219920219042X","汉族","未婚","中共党员","博士研究生","中国农业大学","2019-06-07","海淀区","学校集体户","图们市","吉林省图们市家园小区","海淀区","15600660723","394620205@qq.com","","","2016-09-16","2019-06-06","中国农业大学","动物生产类","动物营养与饲料科学","博士研究生","博士（后）","前 10%","100782","专业技术岗（4）","04064","国家粮食和物资储备局  国家粮食和物资储备局科学研究院  粮油加工研究所","已确认","04064050217",17]
["第二考场",209,101482,"张落桐","女","1995-08-16","身份证","110105199508160026","汉族","未婚","共青团员","硕士研究生","中国农业大学","2019-06-30","朝阳区","居民户","东城区","北京市朝阳区八里庄东里15-2-35","海淀区","13717785364","zhangluotong1995@163.com","","","2017-09-01","2019-06-30","中国农业大学","动物生产类","动物营养与饲料科学","硕士研究生","硕士","前 20%","101482","专业技术岗（4）","04064","国家粮食和物资储备局  国家粮食和物资储备局科学研究院  粮油加工研究所","已确认","04064050218",18]
["第二考场",209,101847,"马景林","男","1994-10-11","身份证","370781199410111813","汉族","未婚","共青团员","硕士研究生","中国农业大学","2019-07-01","青州市","居民户","青州市","山东省青州市高柳镇西马庄村","海淀区","18813121219","majinglin@cau.edu.cn","","","2017-09-01","2019-07-01","中国农业大学","动物生产类","动物营养与饲料科学","硕士研究生","硕士","其它","101847","专业技术岗（4）","04064","国家粮食和物资储备局  国家粮食和物资储备局科学研究院  粮油加工研究所","已确认","04064050219",19]
{"$rows_left_out":6}